Reaction Details
TargetUrokinase-type plasminogen activator
LigandBDBM14480
Substrate/CompetitorBDBM14484
Meas. Tech.Enzyme Assay and Determination of the Inhibition Constants
Ki 390±n/a nM
Citation Katz, BALuong, CHo, JDSomoza, JRGjerstad, ETang, JWilliams, SRVerner, EMackman, RLYoung, WBSprengeler, PAChan, HMortara, KJanc, JWMcGrath, ME Dissecting and designing inhibitor selectivity determinants at the S1 site using an artificial Ala190 protease (Ala190 uPA). J Mol Biol344:527-47 (2004) 
 
Urokinase-type plasminogen activator
Name:Urokinase-type plasminogen activator
Type:Enzyme
Mol. Mass.:48528.62
Organism:Homo sapiens (Human)
Description:P00749
Residue:431
BDBM14480
BDBM14484
NameBDBM14480
Synonyms:CA-22 | [amino({4-[(3-hydroxynaphthalene-2-)amido]phenyl}amino)methylidene]azanium
TypeSmall organic molecule
Emp. Form.C18H17N4O2
Mol. Mass.321.3526
SMILES[#7]\[#6](-[#7])=[#7+]/c1ccc(-[#7]-[#6](=O)-c2cc3ccccc3cc2-[#8])cc1