Reaction Details
TargetUrokinase-type plasminogen activator [179-431,I214M,N322A,S371A]
LigandBDBM14350
Substrate/CompetitorBDBM14484
Meas. Tech.Enzyme Assay and Determination of the Inhibition Constants
Ki 6000±n/a nM
Citation Katz, BALuong, CHo, JDSomoza, JRGjerstad, ETang, JWilliams, SRVerner, EMackman, RLYoung, WBSprengeler, PAChan, HMortara, KJanc, JWMcGrath, ME Dissecting and designing inhibitor selectivity determinants at the S1 site using an artificial Ala190 protease (Ala190 uPA). J Mol Biol344:527-47 (2004) 
 
Urokinase-type plasminogen activator [179-431,I214M,N322A,S371A]
Name:Urokinase-type plasminogen activator [179-431,I214M,N322A,S371A]
Type:Enzyme
Mol. Mass.:28389.65
Organism:Homo sapiens (Human)
Description:Mutagenically deglycosylated (N145A) low molecular mass urokinase (S190A), referred to as Ala190 uPA.
Residue:253
BDBM14350
BDBM14484
NameBDBM14350
Synonyms:2-{5-[amino(iminiumyl)methyl]-6-fluoro-1H-1,3-benzodiazol-2-yl}-6-{[(1S,2S)-2-methylcyclohexyl]oxy}benzen-1-olate CRA-11092
TypeSmall organic molecule
Emp. Form.C21H23FN4O2
Mol. Mass.382.4313
SMILESC[C@H]1CCCC[C@@H]1Oc1cccc(-c2nc3cc(C(N)=[NH2+])c(F)cc3[nH]2)c1[O-]