Reaction Details
TargetUrokinase-type plasminogen activator [179-431,I214M,N322A,S371A]
LigandBDBM14481
Substrate/CompetitorBDBM14484
Meas. Tech.Enzyme Assay and Determination of the Inhibition Constants
Ki 280±n/a nM
Citation Katz, BALuong, CHo, JDSomoza, JRGjerstad, ETang, JWilliams, SRVerner, EMackman, RLYoung, WBSprengeler, PAChan, HMortara, KJanc, JWMcGrath, ME Dissecting and designing inhibitor selectivity determinants at the S1 site using an artificial Ala190 protease (Ala190 uPA). J Mol Biol344:527-47 (2004) 
 
Urokinase-type plasminogen activator [179-431,I214M,N322A,S371A]
Name:Urokinase-type plasminogen activator [179-431,I214M,N322A,S371A]
Type:Enzyme
Mol. Mass.:28389.65
Organism:Homo sapiens (Human)
Description:Mutagenically deglycosylated (N145A) low molecular mass urokinase (S190A), referred to as Ala190 uPA.
Residue:253
BDBM14481
BDBM14484
NameBDBM14481
Synonyms:CA-23 | [amino({5-[(3,4-dihydroxynaphthalene-2-)amido]pyridin-2-yl}amino)methylidene]azanium
TypeSmall organic molecule
Emp. Form.C17H16N5O3
Mol. Mass.338.3401
SMILES[#7]\[#6](-[#7])=[#7+]/c1ccc(-[#7]-[#6](=O)-c2cc3ccccc3c(-[#8])c2-[#8])cn1