Reaction Details
TargetTissue-type plasminogen activator
LigandBDBM14479
Substrate/CompetitorBDBM12774
Meas. Tech.Enzyme Assay and Determination of the Inhibition Constants
Ki 180000±n/a nM
Citation Katz, BALuong, CHo, JDSomoza, JRGjerstad, ETang, JWilliams, SRVerner, EMackman, RLYoung, WBSprengeler, PAChan, HMortara, KJanc, JWMcGrath, ME Dissecting and designing inhibitor selectivity determinants at the S1 site using an artificial Ala190 protease (Ala190 uPA). J Mol Biol344:527-47 (2004) 
 
Tissue-type plasminogen activator
Name:Tissue-type plasminogen activator
Type:Enzyme
Mol. Mass.:62931.08
Organism:Homo sapiens (Human)
Description:n/a
Residue:562
BDBM14479
BDBM12774
NameBDBM14479
Synonyms:CA-21 | [amino({5-[(3-hydroxynaphthalene-2-)amido]pyridin-2-yl}amino)methylidene]azanium
TypeSmall organic molecule
Emp. Form.C17H16N5O2
Mol. Mass.322.3407
SMILES[#7]\[#6](-[#7])=[#7+]/c1ccc(-[#7]-[#6](=O)-c2cc3ccccc3cc2-[#8])cn1