Reaction Details
TargetProthrombin
LigandBDBM14483
Substrate/CompetitorBDBM12679
Meas. Tech.Enzyme Assay and Determination of the Inhibition Constants
Ki>450000±n/a nM
Citation Katz, BALuong, CHo, JDSomoza, JRGjerstad, ETang, JWilliams, SRVerner, EMackman, RLYoung, WBSprengeler, PAChan, HMortara, KJanc, JWMcGrath, ME Dissecting and designing inhibitor selectivity determinants at the S1 site using an artificial Ala190 protease (Ala190 uPA). J Mol Biol344:527-47 (2004) 
 
Prothrombin
Name:Prothrombin
Type:Protein
Mol. Mass.:70029.57
Organism:Homo sapiens (Human)
Description:P00734
Residue:622
BDBM14483
BDBM12679
NameBDBM14483
Synonyms:2-amino-5-[(2-hydroxy-3-phenylbenzene)amido]-1H-1,3-benzodiazol-3-ium | CA-25
TypeSmall organic molecule
Emp. Form.C20H17N4O2
Mol. Mass.345.374
SMILESNc1[nH]c2ccc(NC(=O)c3cccc(-c4ccccc4)c3O)cc2[nH+]1