Reaction Details
TargetBaculoviral IAP repeat-containing protein 3/E3 ubiquitin-protein ligase XIAP
LigandBDBM50071850
Substrate/Competitorn/a
Meas. Tech.Fluorescence Polarization Assay (FPA)
IC50 58.0±n/a nM
Citation Borzilleri, RMKim, KSPerez, HLStang, EMWilliams, DKZhang, L IAP antagonists US Patent US9783573 Publication Date 10/10/2017
 
Baculoviral IAP repeat-containing protein 3/E3 ubiquitin-protein ligase XIAP
Name:Baculoviral IAP repeat-containing protein 3/E3 ubiquitin-protein ligase XIAP
Type:Protein
Mol. Mass.:n/a
Description:n/a
Components:This complex has 2 components.
Component 1
Name:E3 ubiquitin-protein ligase XIAP
Synonyms:API3 E3 ubiquitin-protein ligase XIAP Inhibitor of apoptosis protein 3 X-linked inhibitor of apoptosis XIAP | XIAP_HUMAN
Type:Protein
Mol. Mass.:56685.27
Organism:Homo sapiens (Human)
Description:P98170
Residue:497
Component 2
Name:Baculoviral IAP repeat-containing protein 3
Synonyms:API2 BIRC3_HUMAN Baculoviral IAP repeat-containing protein 3 (IAP1 BIR3) MIHC XIAP-BIR3 | cIAP1/cIAP2
Type:Protein
Mol. Mass.:68365.75
Organism:Homo sapiens (Human)
Description:Q13489
Residue:604
BDBM50071850
NameBDBM50071850
Synonyms:CHEMBL3410808 | US9783573, Example 3
TypeSmall organic molecule
Emp. Form.C60H84N10O8
Mol. Mass.1073.3712
SMILESCN[C@@H](C)C(=O)N[C@H](C(=O)N1C[C@H](C[C@H]1C(=O)N[C@@H]1CCCc2ccccc12)NC(=O)CCCC(=O)Nc1ccc2C[C@H](N(Cc2c1)C(=O)[C@@H](NC(=O)[C@H](C)NC)C(C)(C)C)C(=O)N[C@@H]1CCCc2ccccc12)C(C)(C)C