Reaction Details
TargetBaculoviral IAP repeat-containing protein 2/Baculoviral IAP repeat-containing protein 3/E3 ubiquitin-protein ligase XIAP
LigandBDBM345207
Substrate/Competitorn/a
Meas. Tech.Homogeneous Time Resolved Fluorescence (HTRF) Assay
IC50 6.00±n/a nM
Citation Borzilleri, RMKim, KSPerez, HLStang, EMWilliams, DKZhang, L IAP antagonists US Patent US9783573 Publication Date 10/10/2017
 
Baculoviral IAP repeat-containing protein 2/Baculoviral IAP repeat-containing protein 3/E3 ubiquitin-protein ligase XIAP
Name:Baculoviral IAP repeat-containing protein 2/Baculoviral IAP repeat-containing protein 3/E3 ubiquitin-protein ligase XIAP
Synonyms:XIAP-BIR2-3
Type:Protein
Mol. Mass.:n/a
Description:n/a
Components:This complex has 3 components.
Component 1
Name:E3 ubiquitin-protein ligase XIAP
Type:Protein
Mol. Mass.:56685.27
Organism:Homo sapiens (Human)
Description:P98170
Residue:497
Component 2
Name:Baculoviral IAP repeat-containing protein 3
Synonyms:API2 BIRC3_HUMAN Baculoviral IAP repeat-containing protein 3 (IAP1 BIR3) MIHC XIAP-BIR3 | cIAP1/cIAP2
Type:Protein
Mol. Mass.:68365.75
Organism:Homo sapiens (Human)
Description:Q13489
Residue:604
Component 3
Name:Baculoviral IAP repeat-containing protein 2
Synonyms:API1 BIRC2_HUMAN Cellular inhibitor of apoptosis 1 MIHB | RNF48
Type:Protein
Mol. Mass.:69900.47
Organism:Homo sapiens (Human)
Description:Q13490
Residue:618
BDBM345207
NameBDBM345207
Synonyms:US9783573, Example 57
TypeSmall organic molecule
Emp. Form.C63H82N10O8S
Mol. Mass.1139.452
SMILESCN[C@@H](C)C(=O)N[C@H](C(=O)N1CC(C[C@H]1C(=O)NC1CCCc2ccccc12)NC(=O)c1ccc(cc1)C(=O)Nc1ccc2CC(N(Cc2c1)C(=O)[C@@H](NC(=O)[C@H](C)NC)C(C)(C)SC)C(=O)N[C@@H]1CCCc2ccccc12)C(C)(C)C