Reaction Details
TargetG protein-activated inward rectifier potassium channel 4
LigandBDBM347050
Substrate/Competitorn/a
Meas. Tech.TBD
IC50 174±n/a nM
Citation Duncia, JVGardner, DSHynes, JMacor, JENair, SKPaidi, VRSantella, JBSarkunam, KSistla, RKPolimera, SRWu, H Heteroaryl substituted aminopyridine compounds US Patent US10202390 Publication Date 2/12/2019
 
G protein-activated inward rectifier potassium channel 4
Name:G protein-activated inward rectifier potassium channel 4
Type:PROTEIN
Mol. Mass.:47658.06
Organism:Homo sapiens (Human)
Description:ChEMBL_107914
Residue:419
BDBM347050
NameBDBM347050
Synonyms:US10202390, Example 5
TypeSmall organic molecule
Emp. Form.C22H24N8O
Mol. Mass.416.479
SMILESCC(C)Nc1cc(ncc1-c1cnn(CC(C)(C)O)c1)-c1cnc2cc(cnn12)C#N