Reaction Details
TargetG protein-activated inward rectifier potassium channel 4
LigandBDBM347064
Substrate/Competitorn/a
Meas. Tech.TBD
IC50 3.00±n/a nM
Citation Duncia, JVGardner, DSHynes, JMacor, JENair, SKPaidi, VRSantella, JBSarkunam, KSistla, RKPolimera, SRWu, H Heteroaryl substituted aminopyridine compounds US Patent US10202390 Publication Date 2/12/2019
 
G protein-activated inward rectifier potassium channel 4
Name:G protein-activated inward rectifier potassium channel 4
Type:PROTEIN
Mol. Mass.:47658.06
Organism:Homo sapiens (Human)
Description:ChEMBL_107914
Residue:419
BDBM347064
NameBDBM347064
Synonyms:US10202390, Example 19
TypeSmall organic molecule
Emp. Form.C19H19ClN8
Mol. Mass.394.861
SMILESCCCn1cc(nn1)-c1cnc(cc1NC1CC1)-c1cnc2cc(Cl)cnn12