Reaction Details
TargetG protein-activated inward rectifier potassium channel 4
LigandBDBM347066
Substrate/Competitorn/a
Meas. Tech.TBD
IC50 14.0±n/a nM
Citation Duncia, JVGardner, DSHynes, JMacor, JENair, SKPaidi, VRSantella, JBSarkunam, KSistla, RKPolimera, SRWu, H Heteroaryl substituted aminopyridine compounds US Patent US10202390 Publication Date 2/12/2019
 
G protein-activated inward rectifier potassium channel 4
Name:G protein-activated inward rectifier potassium channel 4
Type:PROTEIN
Mol. Mass.:47658.06
Organism:Homo sapiens (Human)
Description:ChEMBL_107914
Residue:419
BDBM347066
NameBDBM347066
Synonyms:US10202390, Example 21
TypeSmall organic molecule
Emp. Form.C24H26ClN9O3
Mol. Mass.523.975
SMILESCOC(=O)N1CCC(n2cc(nn2)-c2cnc(cc2NC2CC2)-c2cnc3cc(Cl)cnn23)[C@](C)(O)C1