Reaction Details
TargetG protein-activated inward rectifier potassium channel 4
LigandBDBM347071
Substrate/Competitorn/a
Meas. Tech.TBD
IC50 10.00±n/a nM
Citation Duncia, JVGardner, DSHynes, JMacor, JENair, SKPaidi, VRSantella, JBSarkunam, KSistla, RKPolimera, SRWu, H Heteroaryl substituted aminopyridine compounds US Patent US10202390 Publication Date 2/12/2019
 
G protein-activated inward rectifier potassium channel 4
Name:G protein-activated inward rectifier potassium channel 4
Type:PROTEIN
Mol. Mass.:47658.06
Organism:Homo sapiens (Human)
Description:ChEMBL_107914
Residue:419
BDBM347071
NameBDBM347071
Synonyms:US10202390, Example 26
TypeSmall organic molecule
Emp. Form.C22H23N9O2
Mol. Mass.445.4771
SMILESCC(C)(O)CCc1cn(nn1)-c1cnc(cc1NC1COC1)-c1cnn2cc(cnc12)C#N