Reaction Details
TargetG protein-activated inward rectifier potassium channel 4
LigandBDBM347073
Substrate/Competitorn/a
Meas. Tech.TBD
IC50 5.00±n/a nM
Citation Duncia, JVGardner, DSHynes, JMacor, JENair, SKPaidi, VRSantella, JBSarkunam, KSistla, RKPolimera, SRWu, H Heteroaryl substituted aminopyridine compounds US Patent US10202390 Publication Date 2/12/2019
 
G protein-activated inward rectifier potassium channel 4
Name:G protein-activated inward rectifier potassium channel 4
Type:PROTEIN
Mol. Mass.:47658.06
Organism:Homo sapiens (Human)
Description:ChEMBL_107914
Residue:419
BDBM347073
NameBDBM347073
Synonyms:US10202390, Example 28
TypeSmall organic molecule
Emp. Form.C23H24N8O
Mol. Mass.428.4897
SMILESCC(C)Nc1cc(ncc1-c1cc([nH]n1)C1CCOCC1)-c1cnc2cc(cnn12)C#N