Reaction Details
TargetDihydroorotate dehydrogenase (quinone), mitochondrial
LigandBDBM15349
Substrate/CompetitorBDBM15346
Meas. Tech.DHODH Inhibition Assay
pH8±n/a
Temperature295.15±n/a K
IC50 60±10 nM
Citation Baldwin, JMichnoff, CHMalmquist, NAWhite, JRoth, MGRathod, PKPhillips, MA High-throughput screening for potent and selective inhibitors of Plasmodium falciparum dihydroorotate dehydrogenase. J Biol Chem280:21847-53 (2005) 
 
Dihydroorotate dehydrogenase (quinone), mitochondrial
Name:Dihydroorotate dehydrogenase (quinone), mitochondrial
Type:Enzyme
Mol. Mass.:65581.88
Organism:Plasmodium falciparum
Description:His6-tag DHODH was expressed in E. coli.
Residue:569
BDBM15349
BDBM15346
NameBDBM15349
Synonyms:Asinex compound no. 4 | N-(3-bromophenyl)-2-methyl-3-nitrobenzamide
TypeSmall organic molecule
Emp. Form.C14H11BrN2O3
Mol. Mass.335.153
SMILESCc1c(cccc1[N+]([O-])=O)C(=O)Nc1cccc(Br)c1