Reaction Details
TargetDihydroorotate dehydrogenase (quinone), mitochondrial
LigandBDBM14711
Substrate/CompetitorBDBM15346
Meas. Tech.DHODH Inhibition Assay
pH8±n/a
Temperature295.15±n/a K
IC50 16±2 nM
Citation Baldwin, JMichnoff, CHMalmquist, NAWhite, JRoth, MGRathod, PKPhillips, MA High-throughput screening for potent and selective inhibitors of Plasmodium falciparum dihydroorotate dehydrogenase. J Biol Chem280:21847-53 (2005) 
 
Dihydroorotate dehydrogenase (quinone), mitochondrial
Name:Dihydroorotate dehydrogenase (quinone), mitochondrial
Type:Enzyme
Mol. Mass.:65581.88
Organism:Plasmodium falciparum
Description:His6-tag DHODH was expressed in E. coli.
Residue:569
BDBM14711
BDBM15346
NameBDBM14711
Synonyms:Asinex compound no. 6 benzamide compound 3
TypeSmall organic molecule
Emp. Form.C14H10Cl2N2O3
Mol. Mass.325.147
SMILESCc1c(cccc1[N+]([O-])=O)C(=O)Nc1cc(Cl)cc(Cl)c1