Reaction Details
TargetDihydroorotate dehydrogenase (quinone), mitochondrial
LigandBDBM15356
Substrate/CompetitorBDBM15346
Meas. Tech.DHODH Inhibition Assay
pH8±n/a
Temperature295.15±n/a K
IC50 400±40 nM
Citation Baldwin, JMichnoff, CHMalmquist, NAWhite, JRoth, MGRathod, PKPhillips, MA High-throughput screening for potent and selective inhibitors of Plasmodium falciparum dihydroorotate dehydrogenase. J Biol Chem280:21847-53 (2005) 
 
Dihydroorotate dehydrogenase (quinone), mitochondrial
Name:Dihydroorotate dehydrogenase (quinone), mitochondrial
Type:Enzyme
Mol. Mass.:65581.88
Organism:Plasmodium falciparum
Description:His6-tag DHODH was expressed in E. coli.
Residue:569
BDBM15356
BDBM15346
NameBDBM15356
Synonyms:1-naphthalen-1-yl-3-[2-(trifluoromethyl)phenyl]urea | SPECS compound no. 11
TypeSmall organic molecule
Emp. Form.C18H13F3N2O
Mol. Mass.330.3038
SMILESFC(F)(F)c1ccccc1NC(=O)Nc1cccc2ccccc12