Reaction Details
TargetDihydroorotate dehydrogenase (quinone), mitochondrial [30-395]
LigandBDBM15357
Substrate/CompetitorBDBM15346
Meas. Tech.DHODH Inhibition Assay
IC50 112000±n/a nM
Citation Baldwin, JMichnoff, CHMalmquist, NAWhite, JRoth, MGRathod, PKPhillips, MA High-throughput screening for potent and selective inhibitors of Plasmodium falciparum dihydroorotate dehydrogenase. J Biol Chem280:21847-53 (2005) 
 
Dihydroorotate dehydrogenase (quinone), mitochondrial [30-395]
Name:Dihydroorotate dehydrogenase (quinone), mitochondrial [30-395]
Type:Enzyme
Mol. Mass.:39678.95
Organism:Homo sapiens (Human)
Description:Recombinant human DHODH (amino acids 30 to 395) was cloned and expressed in E. coli.
Residue:366
BDBM15357
BDBM15346
NameBDBM15357
Synonyms:3-(2-methoxyphenyl)-1-naphthalen-1-ylurea | ChemBridge compound no. 12
TypeSmall organic molecule
Emp. Form.C18H16N2O2
Mol. Mass.292.3318
SMILESCOc1ccccc1NC(=O)Nc1cccc2ccccc12