Reaction Details
TargetDihydroorotate dehydrogenase (quinone), mitochondrial [H185A]
LigandBDBM15354
Substrate/CompetitorBDBM15346
Meas. Tech.DHODH Inhibition Assay
IC50 60000±n/a nM
Citation Baldwin, JMichnoff, CHMalmquist, NAWhite, JRoth, MGRathod, PKPhillips, MA High-throughput screening for potent and selective inhibitors of Plasmodium falciparum dihydroorotate dehydrogenase. J Biol Chem280:21847-53 (2005) 
 
Dihydroorotate dehydrogenase (quinone), mitochondrial [H185A]
Name:Dihydroorotate dehydrogenase (quinone), mitochondrial [H185A]
Type:Enzyme
Mol. Mass.:65515.32
Organism:Plasmodium falciparum
Description:Q54A96[H185A]
Residue:569
BDBM15354
BDBM15346
NameBDBM15354
Synonyms:Asinex compound no. 9 | N-(3,4-dichlorophenyl)-2-methyl-3-nitrobenzamide
TypeSmall organic molecule
Emp. Form.C14H10Cl2N2O3
Mol. Mass.325.147
SMILESCc1c(cccc1[N+]([O-])=O)C(=O)Nc1ccc(Cl)c(Cl)c1