Reaction Details
TargetCytochrome P450 11B1, mitochondrial
LigandBDBM347695
Substrate/Competitorn/a
Meas. Tech.Inhibition Assay
EC50 0.462±n/a nM
Citation Aebi, JAmrein, KHornsperger, BKuhn, BLi, DLiu, YMaerki, HPMartin, REMayweg, AVTan, XWang, LWu, J Pyridinyloxy- and phenyloxy-pyrazolyl compounds US Patent US9790217 Publication Date 10/17/2017
 
Cytochrome P450 11B1, mitochondrial
Name:Cytochrome P450 11B1, mitochondrial
Type:Enzyme
Mol. Mass.:57591.44
Organism:Homo sapiens (Human)
Description:P15538
Residue:503
BDBM347695
NameBDBM347695
Synonyms:4-[(Z)-2-(Dimethylamino)-1-(4- methylsulfonylbenzoyl)vinyloxy]benzonitrile | US9790217, 18
TypeSmall organic molecule
Emp. Form.C19H18N2O4S
Mol. Mass.370.422
SMILESCN(C)\C=C(/Oc1ccc(cc1)C#N)C(=O)c1ccc(cc1)S(C)(=O)=O