Reaction Details
TargetCytochrome P450 11B2, mitochondrial
LigandBDBM347712
Substrate/Competitorn/a
Meas. Tech.Inhibition Assay
EC50 0.002±n/a nM
Citation Aebi, JAmrein, KHornsperger, BKuhn, BLi, DLiu, YMaerki, HPMartin, REMayweg, AVTan, XWang, LWu, J Pyridinyloxy- and phenyloxy-pyrazolyl compounds US Patent US9790217 Publication Date 10/17/2017
 
Cytochrome P450 11B2, mitochondrial
Name:Cytochrome P450 11B2, mitochondrial
Type:Protein
Mol. Mass.:57582.15
Organism:Homo sapiens (Human)
Description:P19099
Residue:503
BDBM347712
NameBDBM347712
Synonyms:4-[(Z)-1-(2-Chloro-3-fluoro- benzoyl)- (dimethylamino)vinyloxy]benzonitrile | US9790217, 35
TypeSmall organic molecule
Emp. Form.C18H14ClFN2O2
Mol. Mass.344.767
SMILESCN(C)\C=C(/Oc1ccc(cc1)C#N)C(=O)c1cccc(F)c1Cl