Reaction Details
TargetCytochrome P450 11B1, mitochondrial
LigandBDBM347713
Substrate/Competitorn/a
Meas. Tech.Inhibition Assay
EC50 0.053±n/a nM
Citation Aebi, JAmrein, KHornsperger, BKuhn, BLi, DLiu, YMaerki, HPMartin, REMayweg, AVTan, XWang, LWu, J Pyridinyloxy- and phenyloxy-pyrazolyl compounds US Patent US9790217 Publication Date 10/17/2017
 
Cytochrome P450 11B1, mitochondrial
Name:Cytochrome P450 11B1, mitochondrial
Type:Enzyme
Mol. Mass.:57591.44
Organism:Homo sapiens (Human)
Description:P15538
Residue:503
BDBM347713
NameBDBM347713
Synonyms:4-[(Z)-1-(3-Benzyloxybenzoyl)-2- (dimethylamino)vinyloxy]benzonitrile | US9790217, 36
TypeSmall organic molecule
Emp. Form.C25H22N2O3
Mol. Mass.398.4538
SMILESCN(C)\C=C(/Oc1ccc(cc1)C#N)C(=O)c1cccc(OCc2ccccc2)c1