Reaction Details
TargetCytochrome P450 11B1, mitochondrial
LigandBDBM347719
Substrate/Competitorn/a
Meas. Tech.Inhibition Assay
EC50 0.345±n/a nM
Citation Aebi, JAmrein, KHornsperger, BKuhn, BLi, DLiu, YMaerki, HPMartin, REMayweg, AVTan, XWang, LWu, J Pyridinyloxy- and phenyloxy-pyrazolyl compounds US Patent US9790217 Publication Date 10/17/2017
 
Cytochrome P450 11B1, mitochondrial
Name:Cytochrome P450 11B1, mitochondrial
Type:Enzyme
Mol. Mass.:57591.44
Organism:Homo sapiens (Human)
Description:P15538
Residue:503
BDBM347719
NameBDBM347719
Synonyms:5-(2-Chloro-4-methylsulfonylphenyl)-4-(4-chlorophenoxy)-1H-pyrazole | US9790217, 42
TypeSmall organic molecule
Emp. Form.C16H12Cl2N2O3S
Mol. Mass.383.249
SMILESCS(=O)(=O)c1ccc(-c2[nH]ncc2Oc2ccc(Cl)cc2)c(Cl)c1