Reaction Details
TargetCytochrome P450 11B1, mitochondrial
LigandBDBM347724
Substrate/Competitorn/a
Meas. Tech.Inhibition Assay
EC50 0.159±n/a nM
Citation Aebi, JAmrein, KHornsperger, BKuhn, BLi, DLiu, YMaerki, HPMartin, REMayweg, AVTan, XWang, LWu, J Pyridinyloxy- and phenyloxy-pyrazolyl compounds US Patent US9790217 Publication Date 10/17/2017
 
Cytochrome P450 11B1, mitochondrial
Name:Cytochrome P450 11B1, mitochondrial
Type:Enzyme
Mol. Mass.:57591.44
Organism:Homo sapiens (Human)
Description:P15538
Residue:503
BDBM347724
NameBDBM347724
Synonyms:CHEM-US-00117 | US9790217, 47
TypeSmall organic molecule
Emp. Form.C21H18N4O3
Mol. Mass.374.3926
SMILESOCC1CN(C1)C(=O)c1cccc(c1)-c1[nH]ncc1Oc1ccc(cc1)C#N