Reaction Details
TargetCytochrome P450 11B1, mitochondrial
LigandBDBM347728
Substrate/Competitorn/a
Meas. Tech.Inhibition Assay
EC50 0.051±n/a nM
Citation Aebi, JAmrein, KHornsperger, BKuhn, BLi, DLiu, YMaerki, HPMartin, REMayweg, AVTan, XWang, LWu, J Pyridinyloxy- and phenyloxy-pyrazolyl compounds US Patent US9790217 Publication Date 10/17/2017
 
Cytochrome P450 11B1, mitochondrial
Name:Cytochrome P450 11B1, mitochondrial
Type:Enzyme
Mol. Mass.:57591.44
Organism:Homo sapiens (Human)
Description:P15538
Residue:503
BDBM347728
NameBDBM347728
Synonyms:US9790217, 51
TypeSmall organic molecule
Emp. Form.C22H16N4O2
Mol. Mass.368.388
SMILESN#Cc1ccc(Oc2cn[nH]c2-c2cccc(OCc3cccnc3)c2)cc1