Reaction Details
TargetCytochrome P450 11B1, mitochondrial
LigandBDBM347753
Substrate/Competitorn/a
Meas. Tech.Inhibition Assay
EC50 0.139±n/a nM
Citation Aebi, JAmrein, KHornsperger, BKuhn, BLi, DLiu, YMaerki, HPMartin, REMayweg, AVTan, XWang, LWu, J Pyridinyloxy- and phenyloxy-pyrazolyl compounds US Patent US9790217 Publication Date 10/17/2017
 
Cytochrome P450 11B1, mitochondrial
Name:Cytochrome P450 11B1, mitochondrial
Type:Enzyme
Mol. Mass.:57591.44
Organism:Homo sapiens (Human)
Description:P15538
Residue:503
BDBM347753
NameBDBM347753
Synonyms:4-[[3-[3-(Morpholin-4-ylmethyl)phenyl]-1H-pyrazol-4-yl]oxy]benzonitrile | US9790217, 75
TypeSmall organic molecule
Emp. Form.C21H20N4O2
Mol. Mass.360.4091
SMILESN#Cc1ccc(Oc2cn[nH]c2-c2cccc(CN3CCOCC3)c2)cc1