Reaction Details
TargetCytochrome P450 11B1, mitochondrial
LigandBDBM347763
Substrate/Competitorn/a
Meas. Tech.Inhibition Assay
EC50 0.005±n/a nM
Citation Aebi, JAmrein, KHornsperger, BKuhn, BLi, DLiu, YMaerki, HPMartin, REMayweg, AVTan, XWang, LWu, J Pyridinyloxy- and phenyloxy-pyrazolyl compounds US Patent US9790217 Publication Date 10/17/2017
 
Cytochrome P450 11B1, mitochondrial
Name:Cytochrome P450 11B1, mitochondrial
Type:Enzyme
Mol. Mass.:57591.44
Organism:Homo sapiens (Human)
Description:P15538
Residue:503
BDBM347763
NameBDBM347763
Synonyms:CHEM-US-00182 | US9790217, 85
TypeSmall organic molecule
Emp. Form.C22H15FN4O2
Mol. Mass.386.3785
SMILESFc1c(OCc2ccncc2)cccc1-c1[nH]ncc1Oc1ccc(cc1)C#N