Reaction Details
TargetCytochrome P450 11B1, mitochondrial
LigandBDBM347764
Substrate/Competitorn/a
Meas. Tech.Inhibition Assay
EC50 0.028±n/a nM
Citation Aebi, JAmrein, KHornsperger, BKuhn, BLi, DLiu, YMaerki, HPMartin, REMayweg, AVTan, XWang, LWu, J Pyridinyloxy- and phenyloxy-pyrazolyl compounds US Patent US9790217 Publication Date 10/17/2017
 
Cytochrome P450 11B1, mitochondrial
Name:Cytochrome P450 11B1, mitochondrial
Type:Enzyme
Mol. Mass.:57591.44
Organism:Homo sapiens (Human)
Description:P15538
Residue:503
BDBM347764
NameBDBM347764
Synonyms:CHEM-US-00183 | US9790217, 86
TypeSmall organic molecule
Emp. Form.C22H14ClFN4O2
Mol. Mass.420.824
SMILESFc1c(OCc2ccc(Cl)nc2)cccc1-c1[nH]ncc1Oc1ccc(cc1)C#N