Reaction Details
TargetInterleukin-1 receptor-associated kinase 1 [194-712]
LigandBDBM347860
Substrate/Competitorn/a
Meas. Tech.Enzymatic Assay
IC50<100±n/a nM
Citation Jorand-Lebrun, CJones, RWon, ACNguyen, NJohnson, TLDeselm, LCPanda, K Heteroaryl compounds as IRAK inhibitors and uses thereof US Patent US9790221 Publication Date 10/17/2017
 
Interleukin-1 receptor-associated kinase 1 [194-712]
Name:Interleukin-1 receptor-associated kinase 1 [194-712]
Type:Enzyme Catalytic Domain
Mol. Mass.:55943.99
Organism:Homo sapiens (Human)
Description:aa 194-712
Residue:519
BDBM347860
NameBDBM347860
Synonyms:US9790221, Compound 66
TypeSmall organic molecule
Emp. Form.C24H26N8
Mol. Mass.426.5168
SMILESCn1cc(cn1)-c1cccc(c1)-c1ncc(-c2cnn(C)c2)c(NC23CC(N)(C2)CC3)n1