Reaction Details
TargetInterleukin-1 receptor-associated kinase 1 [194-712]
LigandBDBM348037
Substrate/Competitorn/a
Meas. Tech.Enzymatic Assay
IC50<100±n/a nM
Citation Jorand-Lebrun, CJones, RWon, ACNguyen, NJohnson, TLDeselm, LCPanda, K Heteroaryl compounds as IRAK inhibitors and uses thereof US Patent US9790221 Publication Date 10/17/2017
 
Interleukin-1 receptor-associated kinase 1 [194-712]
Name:Interleukin-1 receptor-associated kinase 1 [194-712]
Type:Enzyme Catalytic Domain
Mol. Mass.:55943.99
Organism:Homo sapiens (Human)
Description:aa 194-712
Residue:519
BDBM348037
NameBDBM348037
Synonyms:US9790221, Compound 245
TypeSmall organic molecule
Emp. Form.C25H28N8O2S
Mol. Mass.504.607
SMILESCn1cc(cn1)-c1cccc(c1)-c1ncc(-c2cnn(C)c2)c(NC23CC(CNS(C)(=O)=O)(C2)C3)n1