Reaction Details
TargetInterleukin-1 receptor-associated kinase 1 [194-712]
LigandBDBM348058
Substrate/Competitorn/a
Meas. Tech.Enzymatic Assay
IC50<100±n/a nM
Citation Jorand-Lebrun, CJones, RWon, ACNguyen, NJohnson, TLDeselm, LCPanda, K Heteroaryl compounds as IRAK inhibitors and uses thereof US Patent US9790221 Publication Date 10/17/2017
 
Interleukin-1 receptor-associated kinase 1 [194-712]
Name:Interleukin-1 receptor-associated kinase 1 [194-712]
Type:Enzyme Catalytic Domain
Mol. Mass.:55943.99
Organism:Homo sapiens (Human)
Description:aa 194-712
Residue:519
BDBM348058
NameBDBM348058
Synonyms:US9790221, Compound 266
TypeSmall organic molecule
Emp. Form.C25H26N8O
Mol. Mass.454.5269
SMILESCC(=O)NC12CC(C1)(C2)Nc1nc(ncc1-c1cnn(C)c1)-c1cccc(c1)-c1cnn(C)c1