Reaction Details
TargetInterleukin-1 receptor-associated kinase 1 [194-712]
LigandBDBM348068
Substrate/Competitorn/a
Meas. Tech.Enzymatic Assay
IC50<100±n/a nM
Citation Jorand-Lebrun, CJones, RWon, ACNguyen, NJohnson, TLDeselm, LCPanda, K Heteroaryl compounds as IRAK inhibitors and uses thereof US Patent US9790221 Publication Date 10/17/2017
 
Interleukin-1 receptor-associated kinase 1 [194-712]
Name:Interleukin-1 receptor-associated kinase 1 [194-712]
Type:Enzyme Catalytic Domain
Mol. Mass.:55943.99
Organism:Homo sapiens (Human)
Description:aa 194-712
Residue:519
BDBM348068
NameBDBM348068
Synonyms:US9790221, Compound 276
TypeSmall organic molecule
Emp. Form.C27H32N8O2S
Mol. Mass.532.66
SMILESCn1cc(cn1)-c1cccc(c1)-c1ncc(-c2cnn(C)c2)c(N[C@H]2CC[C@@H](CC2)NS(=O)(=O)C2CC2)n1