Reaction Details
TargetAmine oxidase [flavin-containing] A
LigandBDBM15586
Substrate/CompetitorBDBM10990
Meas. Tech.MAO Activity Assay
pH7.4±n/a
Temperature311.15±n/a K
Ki 7±n/a nM
Citation La Regina, GSilvestri, RArtico, MLavecchia, ANovellino, EBefani, OTurini, PAgostinelli, E New pyrrole inhibitors of monoamine oxidase: synthesis, biological evaluation, and structural determinants of MAO-A and MAO-B selectivity. J Med Chem50:922-31 (2007) 
 
Amine oxidase [flavin-containing] A
Name:Amine oxidase [flavin-containing] A
Type:PROTEIN
Mol. Mass.:59764.63
Organism:Bos taurus
Description:ChEMBL_1501477
Residue:527
BDBM15586
BDBM10990
NameBDBM15586
Synonyms:N-(2-Phenylethyl),N-methyl-1H-pyrrole-2-carboxamide pyrrole inhibitor 12
TypeSmall organic molecule
Emp. Form.C14H16N2O
Mol. Mass.228.2896
SMILESCN(CCc1ccccc1)C(=O)c1ccc[nH]1