Reaction Details
TargetAmine oxidase [flavin-containing] A
LigandBDBM15611
Substrate/CompetitorBDBM10990
Meas. Tech.MAO Activity Assay
Ki 5.4±n/a nM
Citation La Regina, GSilvestri, RArtico, MLavecchia, ANovellino, EBefani, OTurini, PAgostinelli, E New pyrrole inhibitors of monoamine oxidase: synthesis, biological evaluation, and structural determinants of MAO-A and MAO-B selectivity. J Med Chem50:922-31 (2007) 
 
Amine oxidase [flavin-containing] A
Name:Amine oxidase [flavin-containing] A
Type:PROTEIN
Mol. Mass.:59764.63
Organism:Bos taurus
Description:ChEMBL_1501477
Residue:527
BDBM15611
BDBM10990
NameBDBM15611
Synonyms:N-Methyl,N-(propargyl),N-(pyrrol-2-ylmethyl)amine pyrrole inhibitor 4
TypeSmall organic molecule
Emp. Form.C9H12N2
Mol. Mass.148.205
SMILESCN(CC#C)Cc1ccc[nH]1