Reaction Details
TargetProthrombin
LigandBDBM15846
Substrate/CompetitorBDBM13573
Meas. Tech.Thrombin Inhibition Assay
Ki 3163±n/a nM
Citation Nazare, MEssrich, MWill, DWMatter, HRitter, KUrmann, MBauer, ASchreuder, HCzech, JLorenz, MLaux, VWehner, V Novel factor Xa inhibitors based on a 2-carboxyindole scaffold: SAR of P4 substituents in combination with a neutral P1 ligand. Bioorg Med Chem Lett14:4197-201 (2004) 
 
Prothrombin
Name:Prothrombin
Type:Protein
Mol. Mass.:70029.57
Organism:Homo sapiens (Human)
Description:P00734
Residue:622
BDBM15846
BDBM13573
NameBDBM15846
Synonyms:2-carboxyindole-based inhibitor 31 | N-{1-[(1-{[5-(5-chlorothiophen-2-yl)-1,2-oxazol-3-yl]methyl}-1H-indol-2-yl)carbonyl]piperidin-4-yl}pyridin-4-amine
TypeSmall organic molecule
Emp. Form.C27H24ClN5O2S
Mol. Mass.518.03
SMILESClc1ccc(s1)-c1cc(Cn2c(cc3ccccc23)C(=O)N2CCC(CC2)Nc2ccncc2)no1