Reaction Details
TargetVascular endothelial growth factor receptor 2
LigandBDBM227786
Substrate/Competitorn/a
Meas. Tech.KDR (VEGFR-2) Kinase Assay
pH7±n/a
IC50 0.388±n/a nM
Commentsextracted
Citation Schall, AKlar, JLobell, MSchirok, HTelser, JMüller, SBrohm, DBriem, HJörißen, HKeldenich, JBöttger, MVon Degenfeld, GSchlange, TBömer, ULindner, NEilken, HHristodorov, DWasnaire, PGericke, KMBärfacker, L Substituted pyridobenzodiazepinone-derivatives and use thereof US Patent US10047096 Publication Date 8/14/2018
 
Vascular endothelial growth factor receptor 2
Name:Vascular endothelial growth factor receptor 2
Type:Receptor Tyrosine Kinase
Mol. Mass.:151510.97
Organism:Homo sapiens (Human)
Description:P35968
Residue:1356
BDBM227786
NameBDBM227786
Synonyms:8-{[Ethyl(methyl)amino]methyl}-4-[(2-fluoro-5-hydroxy-4-methylphenyl)amino]-6,11-dihydro-5H-pyrido[2,3-b][1,5]benzodiazepin-5-one | US10047096, 49
TypeSmall organic molecule
Emp. Form.C23H24FN5O2
Mol. Mass.421.4674
SMILESCCN(C)Cc1ccc2Nc3nccc(Nc4cc(O)c(C)cc4F)c3C(=O)Nc2c1