Reaction Details
TargetVascular endothelial growth factor receptor 2
LigandBDBM227931
Substrate/Competitorn/a
Meas. Tech.KDR (VEGFR-2) Kinase Assay
pH7±n/a
IC50 0.274±n/a nM
Commentsextracted
Citation Schall, AKlar, JLobell, MSchirok, HTelser, JMüller, SBrohm, DBriem, HJörißen, HKeldenich, JBöttger, MVon Degenfeld, GSchlange, TBömer, ULindner, NEilken, HHristodorov, DWasnaire, PGericke, KMBärfacker, L Substituted pyridobenzodiazepinone-derivatives and use thereof US Patent US10047096 Publication Date 8/14/2018
 
Vascular endothelial growth factor receptor 2
Name:Vascular endothelial growth factor receptor 2
Type:Receptor Tyrosine Kinase
Mol. Mass.:151510.97
Organism:Homo sapiens (Human)
Description:P35968
Residue:1356
BDBM227931
NameBDBM227931
Synonyms:US10047096, 192 | trans-Ethyl 3-[({4-[(2-fluoro-5-hydroxy-4-methylphenyl)amino]-5-oxo-6,11-dihydro-5H-pyrido[2,3-b][1,5]benzodiazepin-8-yl}methyl)amino]cyclobutanecarboxylate
TypeSmall organic molecule
Emp. Form.C27H28FN5O4
Mol. Mass.505.5407
SMILESCCOC(=O)[C@H]1C[C@@H](C1)NCc1ccc2Nc3nccc(Nc4cc(O)c(C)cc4F)c3C(=O)Nc2c1