Reaction Details
TargetAldo-keto reductase family 1 member B1
LigandBDBM16470
Substrate/CompetitorBDBM16241
Meas. Tech.Enzyme Inhibition Assay
pH6.6±n/a
Temperature310.15±n/a K
IC50 8±n/a nM
Citation Van Zandt, MCJones, MLGunn, DEGeraci, LSJones, JHSawicki, DRSredy, JJacot, JLDicioccio, ATPetrova, TMitschler, APodjarny, AD Discovery of 3-[(4,5,7-trifluorobenzothiazol-2-yl)methyl]indole-N-acetic acid (lidorestat) and congeners as highly potent and selective inhibitors of aldose reductase for treatment of chronic diabetic complications. J Med Chem48:3141-52 (2005) 
 
Aldo-keto reductase family 1 member B1
Name:Aldo-keto reductase family 1 member B1
Type:Protein
Mol. Mass.:35855.50
Organism:Homo sapiens (Human)
Description:P15121. 4LAU; 2IKI; 4LB4; 2FZD; 2FZ8; 1US0
Residue:316
BDBM16470
BDBM16241
NameBDBM16470
Synonyms:2-{2-methyl-3-[(4,5,7-trifluoro-1,3-benzothiazol-2-yl)methyl]-1H-indol-1-yl}acetic acid | Indoleacetic Acid Inhibitor 28
TypeSmall organic molecule
Emp. Form.C19H13F3N2O2S
Mol. Mass.390.379
SMILESCc1c(Cc2nc3c(F)c(F)cc(F)c3s2)c2ccccc2n1CC(O)=O