Reaction Details
TargetTyrosine-protein kinase BTK
LigandBDBM350332
Substrate/Competitorn/a
Meas. Tech.Inhibition Assay
IC50<3.16±n/a nM
Citation Lawson, JDSabat, MScorah, NSmith, CVu, PHWang, H Pyridinyl and fused pyridinyl triazolone derivatives US Patent US9801872 Publication Date 10/31/2017
 
Tyrosine-protein kinase BTK
Name:Tyrosine-protein kinase BTK
Type:Enzyme
Mol. Mass.:76289.95
Organism:Homo sapiens (Human)
Description:Q06187
Residue:659
BDBM350332
NameBDBM350332
Synonyms:(S)-3-(8-((1-acryloylpyrrolidin-3-yl)oxy)-1,7-naphthyridin-6-yl)-1H-1,2,4-triazol-5(4H)-one US9801872, Example 16
TypeSmall organic molecule
Emp. Form.C17H16N6O3
Mol. Mass.352.3473
SMILESC=CC(=O)N1CC[C@@H](C1)Oc1nc(cc2cccnc12)-c1n[nH]c(=O)[nH]1