Reaction Details
TargetTyrosine-protein kinase BTK
LigandBDBM350334
Substrate/Competitorn/a
Meas. Tech.Inhibition Assay
IC50<6.31±n/a nM
Citation Lawson, JDSabat, MScorah, NSmith, CVu, PHWang, H Pyridinyl and fused pyridinyl triazolone derivatives US Patent US9801872 Publication Date 10/31/2017
 
Tyrosine-protein kinase BTK
Name:Tyrosine-protein kinase BTK
Type:Enzyme
Mol. Mass.:76289.95
Organism:Homo sapiens (Human)
Description:Q06187
Residue:659
BDBM350334
NameBDBM350334
Synonyms:(S)-3-(1-((1-acryloylpyrrolidin-3-yl)oxy)-7-fluoroisoquinolin-3-yl)-1H-1,2,4-triazol-5(4H)-one US9801872, Example 18
TypeSmall organic molecule
Emp. Form.C18H16FN5O3
Mol. Mass.369.3497
SMILESFc1ccc2cc(nc(O[C@H]3CCN(C3)C(=O)C=C)c2c1)-c1n[nH]c(=O)[nH]1