Reaction Details
TargetOxysterols receptor LXR-beta
LigandBDBM155258
Substrate/Competitorn/a
Meas. Tech.Radioligand Binding Assay
Ki>2500±n/a nM
Citation Dong, CFan, YLeftheris, KLotesta, SDSingh, SBTice, CMZhao, WZheng, YZhuang, L Liver X receptor modulators US Patent US9814715 Publication Date 11/14/2017
 
Oxysterols receptor LXR-beta
Name:Oxysterols receptor LXR-beta
Type:Enzyme Catalytic Domain
Mol. Mass.:50978.79
Organism:Homo sapiens (Human)
Description:P55055
Residue:460
BDBM155258
NameBDBM155258
Synonyms:US9006244, E2b | US9814715, Example 2, isomer 2
TypeSmall organic molecule
Emp. Form.C20H22F3N5O3S
Mol. Mass.469.481
SMILESCC(C)[C@@H]1N(CCn2c1nc1cc(CO)c(cc21)S(C)(=O)=O)c1nccc(n1)C(F)(F)F