Reaction Details
TargetCoagulation factor X
LigandBDBM17278
Substrate/CompetitorBDBM12658
Meas. Tech.Enzyme Inhibition Assay
pH7.5±n/a
Temperature295.15±n/a K
Ki 14±n/a nM
Citation Whitlow, MArnaiz, DOBuckman, BODavey, DDGriedel, BGuilford, WJKoovakkat, SKLiang, AMohan, RPhillips, GBSeto, MShaw, KJXu, WZhao, ZLight, DRMorrissey, MM Crystallographic analysis of potent and selective factor Xa inhibitors complexed to bovine trypsin. Acta Crystallogr D Biol Crystallogr55:1395-404 (1999) 
 
Coagulation factor X
Name:Coagulation factor X
Type:Enzyme
Mol. Mass.:54726.60
Organism:Homo sapiens (Human)
Description:n/a
Residue:488
BDBM17278
BDBM12658
NameBDBM17278
Synonyms:3-{[6-(3-carbamimidoylphenoxy)-3,5-difluoro-4-methylpyridin-2-yl]oxy}benzene-1-carboximidamide Pyridine template, III | ZK-805623
TypeSmall organic molecule
Emp. Form.C20H17F2N5O2
Mol. Mass.397.3781
SMILESCc1c(F)c(Oc2cccc(c2)C(N)=N)nc(Oc2cccc(c2)C(N)=N)c1F