Reaction Details
TargetHepatocyte growth factor receptor
LigandBDBM355854
Substrate/Competitorn/a
Meas. Tech.Kinase Assay
IC50<40±n/a nM
Citation Baik, TGJung, WKim, SIKim, SCPark, SKJung, SYJi, SHKi, SYKim, MCLee, EYHong, EM Protein kinase inhibitor containing pyrrolopyridazine derivative US Patent US9815840 Publication Date 11/14/2017
 
Hepatocyte growth factor receptor
Name:Hepatocyte growth factor receptor
Type:Protein
Mol. Mass.:155559.73
Organism:Homo sapiens (Human)
Description:P08581
Residue:1390
BDBM355854
NameBDBM355854
Synonyms:4-ethoxy-N-(3-fluoro-4-((5-(3-formylphenyl)pyrrolo[1,2-b]pyridazin-4-yl)oxy)phenyl)-1-(4-fluorophenyl)-2-oxo-1,2-dihydropyridin-3-carboxamide | US9815840, Example 23
TypeSmall organic molecule
Emp. Form.C34H24F2N4O5
Mol. Mass.606.575
SMILESCCOc1ccn(-c2ccc(F)cc2)c(=O)c1C(=O)Nc1ccc(Oc2ccnn3ccc(-c4cccc(C=O)c4)c23)c(F)c1