Reaction Details
TargetMethionine aminopeptidase
LigandBDBM17868
Substrate/CompetitorBDBM17848
Meas. Tech.MetAP Inhibition Assay
pH7.5±n/a
Temperature295.15±n/a K
IC50 16000±1800 nM
Citation Douangamath, ADale, GED'Arcy, AAlmstetter, MEckl, RFrutos-Hoener, AHenkel, BIllgen, KNerdinger, SSchulz, HMac Sweeney, AThormann, MTreml, APierau, SWadman, SOefner, C Crystal structures of Staphylococcusaureus methionine aminopeptidase complexed with keto heterocycle and aminoketone inhibitors reveal the formation of a tetrahedral intermediate. J Med Chem47:1325-8 (2004) 
 
Methionine aminopeptidase
Name:Methionine aminopeptidase
Type:Enzyme
Mol. Mass.:27494.40
Organism:Staphylococcus aureus
Description:P0A079
Residue:252
BDBM17868
BDBM17848
NameBDBM17868
Synonyms:(2S)-2-amino-4-(methylsulfanyl)-1-(pyridin-2-yl)butan-1-one | keto-heterocycle inhibitor, 2
TypeSmall organic molecule
Emp. Form.C10H14N2OS
Mol. Mass.210.296
SMILESCSCC[C@H](N)C(=O)c1ccccn1