Reaction Details
Target3-hydroxy-3-methylglutaryl-coenzyme A reductase
LigandBDBM18420
Substrate/CompetitorBDBM18373
Meas. Tech.HMG-CoA Reductase In Vitro Assay
IC50 4.8±n/a nM
Citation Larsen, SDPoel, TJFilipski, KJKohrt, JTPfefferkorn, JASorenson, RJTait, BDAskew, VDillon, LHanselman, JCLu, GHRobertson, ASekerke, CKowala, MCAuerbach, BJ Pyrazole inhibitors of HMG-CoA reductase: An attempt to dramatically reduce synthetic complexity through minimal analog re-design. Bioorg Med Chem Lett17:5567-72 (2007) 
 
3-hydroxy-3-methylglutaryl-coenzyme A reductase
Name:3-hydroxy-3-methylglutaryl-coenzyme A reductase
Type:Enzyme
Mol. Mass.:96689.85
Organism:Rattus norvegicus (rat)
Description:Isolated rat liver microsomes were used as enzyme source.
Residue:887
BDBM18420
BDBM18373
NameBDBM18420
Synonyms:(3R,5S)-6-{[1-(4-fluorophenyl)-3-{[(3R)-3-phenylpiperidin-1-yl]carbonyl}-4-(propan-2-yl)-1H-pyrazol-5-yl]oxy}-3,5-dihydroxyhexanoic acid | oxypyrazole, 4gg
TypeSmall organic molecule
Emp. Form.C30H36FN3O6
Mol. Mass.553.6217
SMILESCC(C)c1c(nn(c1OC[C@@H](O)C[C@@H](O)CC(O)=O)-c1ccc(F)cc1)C(=O)N1CCC[C@@H](C1)c1ccccc1