Reaction Details
TargetAndrogen receptor
LigandBDBM18521
Substrate/CompetitorBDBM18161
Meas. Tech.AR Transcriptional Activation Assay and MDA Whole-Cell Binding Assay
pH7.4±n/a
Temperature310.15±n/a K
Ki 10±n/a nM
EC50 12±0.2 nM
CommentsAgonist efficacy is 101 +/- 5 %.
Citation Martinborough, EShen, YOeveren, ALong, YOLau, TLMarschke, KBChang, WYLópez, FJVajda, EGRix, PJViveros, OHNegro-Vilar, AZhi, L Substituted 6-(1-Pyrrolidine)quinolin-2(1H)-ones as Novel Selective Androgen Receptor Modulators. J Med Chem50:5049-52 (2007) 
 
Androgen receptor
Name:Androgen receptor
Type:Receptor
Mol. Mass.:99185.27
Organism:Homo sapiens (Human)
Description:CHO cells were stably transfected with human AR gene.
Residue:920
BDBM18521
BDBM18161
NameBDBM18521
Synonyms:6-(1-Pyrrolidine)quinolin-2(1H)-one, 4f | 6-[(2R,5R)-2-(chloromethyl)-5-methylpyrrolidin-1-yl]-4-(trifluoromethyl)-1,2-dihydroquinolin-2-one
TypeSmall organic molecule
Emp. Form.C16H16ClF3N2O
Mol. Mass.344.759
SMILESC[C@@H]1CC[C@H](CCl)N1c1ccc2[nH]c(=O)cc(c2c1)C(F)(F)F