Reaction Details
TargetAndrogen receptor
LigandBDBM18584
Substrate/CompetitorBDBM18161
Meas. Tech.AR Transcriptional Activation Assay and MDA Whole-Cell Binding Assay
pH7.4±n/a
Temperature310.15±n/a K
Ki 2.9±n/a nM
EC50 0.9±0.3 nM
CommentshAR agonist efficacy = 107 +/- 17 %
Citation van Oeveren, AMotamedi, MMartinborough, EZhao, SShen, YWest, SChang, WKallel, AMarschke, KBLópez, FJNegro-Vilar, AZhi, L Novel selective androgen receptor modulators: SAR studies on 6-bisalkylamino-2-quinolinones. Bioorg Med Chem Lett17:1527-31 (2007) 
 
Androgen receptor
Name:Androgen receptor
Type:Receptor
Mol. Mass.:99185.27
Organism:Homo sapiens (Human)
Description:CHO cells were stably transfected with human AR gene.
Residue:920
BDBM18584
BDBM18161
NameBDBM18584
Synonyms:6-[propan-2-yl(2,2,2-trifluoroethyl)amino]-4-(trifluoromethyl)-1,2-dihydroquinolin-2-one | 6-bisalkylamino-2-quinolinone, 6i
TypeSmall organic molecule
Emp. Form.C15H14F6N2O
Mol. Mass.352.2749
SMILESCC(C)N(CC(F)(F)F)c1ccc2[nH]c(=O)cc(c2c1)C(F)(F)F