Reaction Details
TargetAndrogen receptor
LigandBDBM18587
Substrate/CompetitorBDBM18161
Meas. Tech.AR Transcriptional Activation Assay and MDA Whole-Cell Binding Assay
pH7.4±n/a
Temperature310.15±n/a K
Ki 29±n/a nM
EC50 5.9±4.1 nM
CommentshAR agonist efficacy = 86 +/- 16 %
Citation van Oeveren, AMotamedi, MMartinborough, EZhao, SShen, YWest, SChang, WKallel, AMarschke, KBLópez, FJNegro-Vilar, AZhi, L Novel selective androgen receptor modulators: SAR studies on 6-bisalkylamino-2-quinolinones. Bioorg Med Chem Lett17:1527-31 (2007) 
 
Androgen receptor
Name:Androgen receptor
Type:Receptor
Mol. Mass.:99185.27
Organism:Homo sapiens (Human)
Description:CHO cells were stably transfected with human AR gene.
Residue:920
BDBM18587
BDBM18161
NameBDBM18587
Synonyms:6-[butan-2-yl(2,2,2-trifluoroethyl)amino]-4-(trifluoromethyl)-1,2-dihydroquinolin-2-one | 6-bisalkylamino-2-quinolinone, 6l (+/-)
TypeSmall organic molecule
Emp. Form.C16H16F6N2O
Mol. Mass.366.3015
SMILESCCC(C)N(CC(F)(F)F)c1ccc2[nH]c(=O)cc(c2c1)C(F)(F)F