Reaction Details
TargetAndrogen receptor
LigandBDBM18594
Substrate/CompetitorBDBM18161
Meas. Tech.AR Transcriptional Activation Assay and MDA Whole-Cell Binding Assay
pH7.4±n/a
Temperature310.15±n/a K
Ki 79±n/a nM
EC50 27±n/a nM
CommentshAR agonist efficacy = 71 %
Citation van Oeveren, AMotamedi, MMartinborough, EZhao, SShen, YWest, SChang, WKallel, AMarschke, KBLópez, FJNegro-Vilar, AZhi, L Novel selective androgen receptor modulators: SAR studies on 6-bisalkylamino-2-quinolinones. Bioorg Med Chem Lett17:1527-31 (2007) 
 
Androgen receptor
Name:Androgen receptor
Type:Receptor
Mol. Mass.:99185.27
Organism:Homo sapiens (Human)
Description:CHO cells were stably transfected with human AR gene.
Residue:920
BDBM18594
BDBM18161
NameBDBM18594
Synonyms:6-[benzyl(2,2,2-trifluoroethyl)amino]-4-(trifluoromethyl)-1,2-dihydroquinolin-2-one | 6-bisalkylamino-2-quinolinone, 6s
TypeSmall organic molecule
Emp. Form.C19H14F6N2O
Mol. Mass.400.3177
SMILESFC(F)(F)CN(Cc1ccccc1)c1ccc2[nH]c(=O)cc(c2c1)C(F)(F)F