Reaction Details
TargetAndrogen receptor
LigandBDBM18598
Substrate/CompetitorBDBM18161
Meas. Tech.AR Transcriptional Activation Assay and MDA Whole-Cell Binding Assay
Ki 14±n/a nM
EC50 2.8±n/a nM
Citation van Oeveren, AMotamedi, MMartinborough, EZhao, SShen, YWest, SChang, WKallel, AMarschke, KBLópez, FJNegro-Vilar, AZhi, L Novel selective androgen receptor modulators: SAR studies on 6-bisalkylamino-2-quinolinones. Bioorg Med Chem Lett17:1527-31 (2007) 
 
Androgen receptor
Name:Androgen receptor
Type:Receptor
Mol. Mass.:99185.27
Organism:Homo sapiens (Human)
Description:CHO cells were stably transfected with human AR gene.
Residue:920
BDBM18598
BDBM18161
NameBDBM18598
Synonyms:6-[ethyl(furan-3-ylmethyl)amino]-4-(trifluoromethyl)-1,2-dihydroquinolin-2-one | 6-bisalkylamino-2-quinolinone, 6w
TypeSmall organic molecule
Emp. Form.C17H15F3N2O2
Mol. Mass.336.3084
SMILESCCN(Cc1ccoc1)c1ccc2[nH]c(=O)cc(c2c1)C(F)(F)F