Reaction Details
TargetAndrogen receptor
LigandBDBM18609
Substrate/CompetitorBDBM18161
Meas. Tech.AR Transcriptional Activation Assay and MDA Whole-Cell Binding Assay
Ki 1000±n/a nM
IC50 7.0±n/a nM
EC50 83±n/a nM
Citation van Oeveren, AMotamedi, MMartinborough, EZhao, SShen, YWest, SChang, WKallel, AMarschke, KBLópez, FJNegro-Vilar, AZhi, L Novel selective androgen receptor modulators: SAR studies on 6-bisalkylamino-2-quinolinones. Bioorg Med Chem Lett17:1527-31 (2007) 
 
Androgen receptor
Name:Androgen receptor
Type:Receptor
Mol. Mass.:99185.27
Organism:Homo sapiens (Human)
Description:CHO cells were stably transfected with human AR gene.
Residue:920
BDBM18609
BDBM18161
NameBDBM18609
Synonyms:6-[bis(2,2,2-trifluoroethyl)amino]-4-hydroxy-1,2-dihydroquinolin-2-one | 6-bisalkylamino-2-quinolinone, 7j
TypeSmall organic molecule
Emp. Form.C13H10F6N2O2
Mol. Mass.340.2211
SMILESOc1cc(=O)[nH]c2ccc(cc12)N(CC(F)(F)F)CC(F)(F)F