Reaction Details
TargetAndrogen receptor
LigandBDBM18613
Substrate/CompetitorBDBM18161
Meas. Tech.AR Transcriptional Activation Assay and MDA Whole-Cell Binding Assay
Ki 9.8±n/a nM
EC50 3.6±n/a nM
Citation van Oeveren, AMotamedi, MMartinborough, EZhao, SShen, YWest, SChang, WKallel, AMarschke, KBLópez, FJNegro-Vilar, AZhi, L Novel selective androgen receptor modulators: SAR studies on 6-bisalkylamino-2-quinolinones. Bioorg Med Chem Lett17:1527-31 (2007) 
 
Androgen receptor
Name:Androgen receptor
Type:Receptor
Mol. Mass.:99185.27
Organism:Homo sapiens (Human)
Description:CHO cells were stably transfected with human AR gene.
Residue:920
BDBM18613
BDBM18161
NameBDBM18613
Synonyms:6-bisalkylamino-2-quinolinone, 8d | 6-{[(2S)-1-chloropropan-2-yl](2,2,2-trifluoroethyl)amino}-4-(trifluoromethyl)-1,2-dihydroquinolin-2-one
TypeSmall organic molecule
Emp. Form.C15H13ClF6N2O
Mol. Mass.386.72
SMILESC[C@@H](CCl)N(CC(F)(F)F)c1ccc2[nH]c(=O)cc(c2c1)C(F)(F)F